BDBM50257836 2-(4-chlorophenyl)-4,4-bis(4-fluorophenyl)-4,5-dihydro-1H-imidazole::CHEMBL492779
SMILES Fc1ccc(cc1)C1(CNC(=N1)c1ccc(Cl)cc1)c1ccc(F)cc1
InChI Key InChIKey=MRMXQLNSYVKKLS-UHFFFAOYSA-N
Data  1 IC50
  Tab Delimited (TSV)   2D SDfile   Computed 3D by Vconf -m prep SDfile
Find this compound or compounds like it in BindingDB:
Activity Spreadsheet -- Enzyme Inhibition Constant Data from BindingDB
Found 1 hit for monomerid = 50257836
TargetNeuropeptide Y receptor type 5(Homo sapiens (Human))
Tsukuba Research Institute
Curated by ChEMBL
LigandPNGBDBM50257836(2-(4-chlorophenyl)-4,4-bis(4-fluorophenyl)-4,5-dih...)
Affinity DataIC50:  130nM. Assay description: Displacement of [125I]PYY from human recombinant neuropeptide Y5 receptor expressed in thymidine kinase-deficient mouse LM cells
In DepthDetails ArticlePubMed