BDBM50257895 4,4-bis(4-fluorophenyl)-2-(3-nitrophenyl)-4,5-dihydro-1H-imidazole::CHEMBL492594
SMILES [O-][N+](=O)c1cccc(c1)C1=NC(CN1)(c1ccc(F)cc1)c1ccc(F)cc1
InChI Key InChIKey=YPUNVQQHZAUQPF-UHFFFAOYSA-N
Data  1 IC50
  Tab Delimited (TSV)   2D SDfile   Computed 3D by Vconf -m prep SDfile
Find this compound or compounds like it in BindingDB:
Activity Spreadsheet -- Enzyme Inhibition Constant Data from BindingDB
Found 1 hit for monomerid = 50257895
TargetNeuropeptide Y receptor type 5(Homo sapiens (Human))
Tsukuba Research Institute
Curated by ChEMBL
LigandPNGBDBM50257895(4,4-bis(4-fluorophenyl)-2-(3-nitrophenyl)-4,5-dihy...)
Affinity DataIC50:  4.30nM. Assay description: Displacement of [125I]PYY from human recombinant neuropeptide Y5 receptor expressed in thymidine kinase-deficient mouse LM cells
In DepthDetails ArticlePubMed