BDBM50257988 3-(4,4-bis(4-fluorophenyl)-4,5-dihydro-1H-imidazol-2-yl)-N,N-dimethylaniline::CHEMBL522183
SMILES CN(C)c1cccc(c1)C1=NC(CN1)(c1ccc(F)cc1)c1ccc(F)cc1
InChI Key InChIKey=AHIHRCLJRIXGEW-UHFFFAOYSA-N
Data  1 IC50
  Tab Delimited (TSV)   2D SDfile   Computed 3D by Vconf -m prep SDfile
Find this compound or compounds like it in BindingDB:
Activity Spreadsheet -- Enzyme Inhibition Constant Data from BindingDB
Found 1 hit for monomerid = 50257988
TargetNeuropeptide Y receptor type 5(Homo sapiens (Human))
Tsukuba Research Institute
Curated by ChEMBL
LigandPNGBDBM50257988(3-(4,4-bis(4-fluorophenyl)-4,5-dihydro-1H-imidazol...)
Affinity DataIC50: >1.00E+3nM. Assay description: Displacement of [125I]PYY from human recombinant neuropeptide Y5 receptor expressed in thymidine kinase-deficient mouse LM cells
In DepthDetails ArticlePubMed