BDBM50257990 4,4-bis(4-fluorophenyl)-2-(thiophen-2-yl)-4,5-dihydro-1H-imidazole::CHEMBL494175
SMILES Fc1ccc(cc1)C1(CNC(=N1)c1cccs1)c1ccc(F)cc1
InChI Key InChIKey=ZPZXOKLXALTLTB-UHFFFAOYSA-N
Data  1 IC50
  Tab Delimited (TSV)   2D SDfile   Computed 3D by Vconf -m prep SDfile
Find this compound or compounds like it in BindingDB:
Activity Spreadsheet -- Enzyme Inhibition Constant Data from BindingDB
Found 1 hit for monomerid = 50257990
TargetNeuropeptide Y receptor type 5(Homo sapiens (Human))
Tsukuba Research Institute
Curated by ChEMBL
LigandPNGBDBM50257990(4,4-bis(4-fluorophenyl)-2-(thiophen-2-yl)-4,5-dihy...)
Affinity DataIC50:  54nM. Assay description: Displacement of [125I]PYY from human recombinant neuropeptide Y5 receptor expressed in thymidine kinase-deficient mouse LM cells
In DepthDetails ArticlePubMed