BDBM50258053 CHEMBL492568::N-(biphenyl-4-yl)-1-(methylsulfonyl)spiro[indoline-3,4'-piperidine]-1'-carboxamide
SMILES CS(=O)(=O)N1CC2(CCN(CC2)C(=O)Nc2ccc(cc2)-c2ccccc2)c2ccccc12
InChI Key InChIKey=HXFXDYHBJKXSJH-UHFFFAOYSA-N
Data  1 IC50
  Tab Delimited (TSV)   2D SDfile   Computed 3D by Vconf -m prep SDfile
Find this compound or compounds like it in BindingDB:
Activity Spreadsheet -- Enzyme Inhibition Constant Data from BindingDB
Found 1 hit for monomerid = 50258053
TargetNeuropeptide Y receptor type 5(Homo sapiens (Human))
Tsukuba Research Institute
Curated by ChEMBL
LigandPNGBDBM50258053(CHEMBL492568 | N-(biphenyl-4-yl)-1-(methylsulfonyl...)
Affinity DataIC50:  0.850nM. Assay description: Displacement of [125I]PYY from human recombinant Y5 receptor expressed in mouse LMtk cells
In DepthDetails ArticlePubMed