BDBM50258150 1-(Methylsulfonyl)-N-[4-(pyridin-4-yl)phenyl]-1,2-dihydro-1'H-spiro[indole-3,4'-piperidine]-1'-carboxamide::1-(methylsulfonyl)-N-(4-(pyridin-4-yl)phenyl)spiro[indoline-3,4'-piperidine]-1'-carboxamide::CHEMBL523205
SMILES CS(=O)(=O)N1CC2(CCN(CC2)C(=O)Nc2ccc(cc2)-c2ccncc2)c2ccccc12
InChI Key InChIKey=QJUAFMBSBJTDHW-UHFFFAOYSA-N
Data  2 IC50
  Tab Delimited (TSV)   2D SDfile   Computed 3D by Vconf -m prep SDfile
Find this compound or compounds like it in BindingDB:
Activity Spreadsheet -- Enzyme Inhibition Constant Data from BindingDB
Found 2 hits for monomerid = 50258150
TargetNeuropeptide Y receptor type 5(Homo sapiens (Human))
Tsukuba Research Institute
Curated by ChEMBL
LigandPNGBDBM50258150(1-(Methylsulfonyl)-N-[4-(pyridin-4-yl)phenyl]-1,2-...)
Affinity DataIC50:  4.10nM. Assay description: Binding affinity to human neuropeptide Y5 receptor
In DepthDetails ArticlePubMed
TargetNeuropeptide Y receptor type 5(Homo sapiens (Human))
Tsukuba Research Institute
Curated by ChEMBL
LigandPNGBDBM50258150(1-(Methylsulfonyl)-N-[4-(pyridin-4-yl)phenyl]-1,2-...)
Affinity DataIC50:  4.10nM. Assay description: Displacement of [125I]PYY from human recombinant Y5 receptor expressed in mouse LMtk cells
In DepthDetails ArticlePubMed