BDBM50258189 (+)-(1R,2R,5S)-6-Allyl-2-benzyloxy-8-(4-methoxybenzyl)-6,8-diazabicyclo[3.2.2]nonane::CHEMBL523045
SMILES COc1ccc(CN2C[C@@H]3CC[C@@H](OCc4ccccc4)[C@H]2CN3CC=C)cc1
InChI Key InChIKey=IMNBWSFURFCFMF-ICDZXHCJSA-N
Data  1 KI
  Tab Delimited (TSV)   2D SDfile   Computed 3D by Vconf -m prep SDfile
Find this compound or compounds like it in BindingDB:
Activity Spreadsheet -- Enzyme Inhibition Constant Data from BindingDB
Found 1 hit for monomerid = 50258189
TargetSigma non-opioid intracellular receptor 1(Cavia porcellus (Guinea pig))
Institut Fur Pharmazeutische Und Medizinische Chemie Der Westfalischen Wilhelms-Universitat Munster
Curated by ChEMBL
LigandPNGBDBM50258189((+)-(1R,2R,5S)-6-Allyl-2-benzyloxy-8-(4-methoxyben...)
Affinity DataKi:  366nM. Assay description: Displacement of [3H](+)-pentazocine from sigma 1 receptor in guinea pig brain membrane by scintillation analysis
In DepthDetails ArticlePubMed