BDBM50258305 CHEMBL4102110
SMILES CCC(NC(=O)c1cnn2cc(C)cnc12)c1ccccc1
InChI Key InChIKey=PNHXEEVBTKBNPY-UHFFFAOYSA-N
Data  1 IC50
  Tab Delimited (TSV)   2D SDfile   Computed 3D by Vconf -m prep SDfile
Find this compound or compounds like it in BindingDB:
Activity Spreadsheet -- Enzyme Inhibition Constant Data from BindingDB
Found 1 hit for monomerid = 50258305
TargetcGMP-dependent 3',5'-cyclic phosphodiesterase(Homo sapiens (Human))
Takeda Pharmaceutical
Curated by ChEMBL
LigandPNGBDBM50258305(CHEMBL4102110)
Affinity DataIC50:  3.60E+3nM. Assay description: Inhibition of full length recombinant human His-tagged PDE2A3 expressed in fall armyworm Sf9 cells using [3H]cGMP as substrate preincubated for 30 mi...
Ligand InfoPC cidPC sid
In DepthDetails ArticlePubMed