BDBM50258447 (E)-3-(2,2-Dimethyl-2,3-dihydrobenzofuran-5-yl)-N-(3-fluoro-4-(methylsulfonamido)benzyl)acrylamide::CHEMBL467463
SMILES CC1(C)Cc2cc(\C=C\C(=O)NCc3ccc(NS(C)(=O)=O)c(F)c3)ccc2O1
InChI Key InChIKey=SYZFZFIIUVMSKH-RMKNXTFCSA-N
Data  1 IC50
  Tab Delimited (TSV)   2D SDfile   Computed 3D by Vconf -m prep SDfile
Find this compound or compounds like it in BindingDB:
Activity Spreadsheet -- Enzyme Inhibition Constant Data from BindingDB
Found 1 hit for monomerid = 50258447
TargetTransient receptor potential cation channel subfamily V member 1(Rattus norvegicus (rat))
Seoul National University
Curated by ChEMBL
LigandPNGBDBM50258447((E)-3-(2,2-Dimethyl-2,3-dihydrobenzofuran-5-yl)-N-...)
Affinity DataIC50:  4.30E+3nM. Assay description: Antagonist activity at TRPV1 in Sprague-Dawley rat DRG neuron assessed as reduction of capsaicin-stimulated 45Ca2+ uptake
In DepthDetails ArticlePubMed