BDBM50258476 3-(4-tert-Butylphenyl)-N-(3-cyano-5-fluoro-4-(methylsulfonamido)benzyl)propanamide::3-(4-tert-Butylphenyl)-N-[3-cyano-5-fluoro-4-(methylsulfonamido)benzyl]propanamide::CHEMBL466018
SMILES CC(C)(C)c1ccc(CCC(=O)NCc2cc(F)c(NS(C)(=O)=O)c(c2)C#N)cc1
InChI Key InChIKey=KYIBDFYQJIGXCS-UHFFFAOYSA-N
Data  2 IC50
  Tab Delimited (TSV)   2D SDfile   Computed 3D by Vconf -m prep SDfile
Find this compound or compounds like it in BindingDB:
Activity Spreadsheet -- Enzyme Inhibition Constant Data from BindingDB
Found 2 hits for monomerid = 50258476
TargetTransient receptor potential cation channel subfamily V member 1(Rattus norvegicus (rat))
Seoul National University
Curated by ChEMBL
LigandPNGBDBM50258476(3-(4-tert-Butylphenyl)-N-(3-cyano-5-fluoro-4-(meth...)
Affinity DataIC50:  85nM. Assay description: Antagonist activity at TRPV1 in Sprague-Dawley rat DRG neurons assessed as inhibition of capsaicin-induced [45]Ca2+ uptake
In DepthDetails ArticlePubMed
TargetTransient receptor potential cation channel subfamily V member 1(Rattus norvegicus (rat))
Seoul National University
Curated by ChEMBL
LigandPNGBDBM50258476(3-(4-tert-Butylphenyl)-N-(3-cyano-5-fluoro-4-(meth...)
Affinity DataIC50:  85nM. Assay description: Antagonist activity at TRPV1 in Sprague-Dawley rat DRG neuron assessed as reduction of capsaicin-stimulated 45Ca2+ uptake
In DepthDetails ArticlePubMed