BDBM50258838 (E)-N-(3-Fluoro-4-(methylsulfonamido)benzyl)-3-(4-iodophenyl)acrylmide::CHEMBL449000
SMILES CS(=O)(=O)Nc1ccc(CNC(=O)\C=C\c2ccc(I)cc2)cc1F
InChI Key InChIKey=KLOPICDADCEBGF-WEVVVXLNSA-N
Data  1 IC50
  Tab Delimited (TSV)   2D SDfile   Computed 3D by Vconf -m prep SDfile
Find this compound or compounds like it in BindingDB:
Activity Spreadsheet -- Enzyme Inhibition Constant Data from BindingDB
Found 1 hit for monomerid = 50258838
TargetTransient receptor potential cation channel subfamily V member 1(Rattus norvegicus (rat))
Seoul National University
Curated by ChEMBL
LigandPNGBDBM50258838((E)-N-(3-Fluoro-4-(methylsulfonamido)benzyl)-3-(4-...)
Affinity DataIC50: >1.00E+4nM. Assay description: Antagonist activity at TRPV1 in Sprague-Dawley rat DRG neuron assessed as reduction of capsaicin-stimulated 45Ca2+ uptake
In DepthDetails ArticlePubMed