BDBM50258839 (E)-3-(4-tert-Butylphenyl)-N-(3-fluoro-4-(methylsulfonamido)benzyl)acrylamide::CHEMBL504884
SMILES CC(C)(C)c1ccc(\C=C\C(=O)NCc2ccc(NS(C)(=O)=O)c(F)c2)cc1
InChI Key InChIKey=OIGYNSAUCNCHPH-XYOKQWHBSA-N
Data  1 IC50
  Tab Delimited (TSV)   2D SDfile   Computed 3D by Vconf -m prep SDfile
Find this compound or compounds like it in BindingDB:
Activity Spreadsheet -- Enzyme Inhibition Constant Data from BindingDB
Found 1 hit for monomerid = 50258839
TargetTransient receptor potential cation channel subfamily V member 1(Rattus norvegicus (rat))
Seoul National University
Curated by ChEMBL
LigandPNGBDBM50258839((E)-3-(4-tert-Butylphenyl)-N-(3-fluoro-4-(methylsu...)
Affinity DataIC50:  490nM. Assay description: Antagonist activity at TRPV1 in Sprague-Dawley rat DRG neuron assessed as reduction of capsaicin-stimulated 45Ca2+ uptake
In DepthDetails ArticlePubMed