BDBM50259004 1'-[4-Fluorobenzyl]-3H-spiro[[2]benzofuran-1,4'piperidine]::CHEMBL466289
SMILES Fc1ccc(CN2CCC3(CC2)OCc2ccccc32)cc1
InChI Key InChIKey=IXCUXQYCEDZXOJ-UHFFFAOYSA-N
Data  2 KI
  Tab Delimited (TSV)   2D SDfile   Computed 3D by Vconf -m prep SDfile
Find this compound or compounds like it in BindingDB:
Activity Spreadsheet -- Enzyme Inhibition Constant Data from BindingDB
Found 2 hits for monomerid = 50259004
TargetSigma non-opioid intracellular receptor 1(Cavia porcellus (Guinea pig))
Institut FüR Pharmazeutische Und Medizinische Chemie Der UniversitäT MüNster
Curated by ChEMBL
LigandPNGBDBM50259004(1'-[4-Fluorobenzyl]-3H-spiro[[2]benzofuran-1,4'pip...)
Affinity DataKi:  0.180nM. Assay description: Displacement of [3H](+)-pentazocine from sigma 1 receptor in guinea pig brain membrane by solid scintillation analysis
In DepthDetails ArticlePubMed
TargetSigma non-opioid intracellular receptor 1(RAT)
Key Laboratory Of Radiopharmaceuticals Beijing Normal University
Curated by ChEMBL
LigandPNGBDBM50259004(1'-[4-Fluorobenzyl]-3H-spiro[[2]benzofuran-1,4'pip...)
Affinity DataKi:  0.580nM. Assay description: Displacement of (+)-[3H]pentazocine from rat brain sigma1 receptor by competitive binding assay
In DepthDetails ArticlePubMed