BDBM50259243 (5-(1-(3-Methylbenzyl)-1H-indazol-3-yl)-1,2,4-oxadiazol-3-yl)methanamine::CHEMBL466917
SMILES Cc1cccc(Cn2nc(-c3nc(CN)no3)c3ccccc23)c1
InChI Key InChIKey=BNMKCPCRZMOAKU-UHFFFAOYSA-N
Data  2 IC50
  Tab Delimited (TSV)   2D SDfile   Computed 3D by Vconf -m prep SDfile
Find this compound or compounds like it in BindingDB:
Activity Spreadsheet -- Enzyme Inhibition Constant Data from BindingDB
Found 2 hits for monomerid = 50259243
TargetCytochrome P450 2D6(Homo sapiens (Human))
University College London
Curated by ChEMBL
LigandPNGBDBM50259243((5-(1-(3-Methylbenzyl)-1H-indazol-3-yl)-1,2,4-oxad...)
Affinity DataIC50:  3.96E+3nM. Assay description: Inhibition of human recombinant CYP2D6
In DepthDetails ArticlePubMed
TargetCytochrome P450 1A2(Homo sapiens (Human))
University College London
Curated by ChEMBL
LigandPNGBDBM50259243((5-(1-(3-Methylbenzyl)-1H-indazol-3-yl)-1,2,4-oxad...)
Affinity DataIC50:  84nM. Assay description: Inhibition of human recombinant CYP1A2
In DepthDetails ArticlePubMed