BDBM50259322 (S)-4'-{2-[(2-Hydroxy-3-phenoxypropyl)amino]ethyl}-2-[1-(4-chlorobenzyl)imidazol-2-yl]acetanilide::CHEMBL467502
SMILES O[C@@H](CNCCc1ccc(NC(=O)Cc2nccn2Cc2ccc(Cl)cc2)cc1)COc1ccccc1
InChI Key InChIKey=PRRQGANLUANRHQ-SANMLTNESA-N
Data  3 EC50
  Tab Delimited (TSV)   2D SDfile   Computed 3D by Vconf -m prep SDfile
Find this compound or compounds like it in BindingDB:
Activity Spreadsheet -- Enzyme Inhibition Constant Data from BindingDB
Found 3 hits for monomerid = 50259322
TargetBeta-2 adrenergic receptor(Homo sapiens (Human))
Astellas Pharma
Curated by ChEMBL
LigandPNGBDBM50259322((S)-4'-{2-[(2-Hydroxy-3-phenoxypropyl)amino]ethyl}...)
Affinity DataEC50: >1.00E+5nM. Assay description: Agonist activity at human beta2 adrenergic receptor expressed in CHO cells assessed as cAMP accumulation
In DepthDetails ArticlePubMed
TargetBeta-1 adrenergic receptor(Homo sapiens (Human))
Astellas Pharma
Curated by ChEMBL
LigandPNGBDBM50259322((S)-4'-{2-[(2-Hydroxy-3-phenoxypropyl)amino]ethyl}...)
Affinity DataEC50:  270nM. Assay description: Agonist activity at human beta-1 adrenergic receptor expressed in CHO cells assessed as cAMP accumulation
In DepthDetails ArticlePubMed
TargetBeta-3 adrenergic receptor(Homo sapiens (Human))
Astellas Pharma
Curated by ChEMBL
LigandPNGBDBM50259322((S)-4'-{2-[(2-Hydroxy-3-phenoxypropyl)amino]ethyl}...)
Affinity DataEC50:  74nM. Assay description: Agonist activity at human beta3 adrenergic receptor expressed in CHO cells assessed as cAMP accumulation
In DepthDetails ArticlePubMed