BDBM50259688 CHEMBL4061895
SMILES Cc1cc(Nc2cccc3C(=O)N(Cc23)C2CCC(=O)NC2=O)n2nc(SCc3nc4ccccc4[nH]3)nc2n1
InChI Key InChIKey=BTDDZFGJYLEFIL-UHFFFAOYSA-N
Data  1 IC50
  Tab Delimited (TSV)   2D SDfile   Computed 3D by Vconf -m prep SDfile
Find this compound or compounds like it in BindingDB:
Activity Spreadsheet -- Enzyme Inhibition Constant Data from BindingDB
Found 1 hit for monomerid = 50259688
TargetLysine-specific histone demethylase 1A(Homo sapiens (Human))
Zhengzhou University
Curated by ChEMBL
LigandPNGBDBM50259688(CHEMBL4061895)
Affinity DataIC50: >1.00E+4nM. Assay description: Dissociation constant against galectin-3 using competitive fluorescence polarization
In DepthDetails ArticlePubMed