BDBM50260013 CHEMBL4070502
SMILES CC1CN(Cc2cc(ccc12)C(=O)Nc1cc(CN2CCN(C)CC2)cc(c1)-c1ccccc1)c1cncnc1
InChI Key InChIKey=FFGQCLBVJOIXHC-UHFFFAOYSA-N
Data  4 IC50
  Tab Delimited (TSV)   2D SDfile   Computed 3D by Vconf -m prep SDfile
Find this compound or compounds like it in BindingDB:
Activity Spreadsheet -- Enzyme Inhibition Constant Data from BindingDB
Found 4 hits for monomerid = 50260013
TargetEpithelial discoidin domain-containing receptor 1(Homo sapiens (Human))
Jinan University
Curated by ChEMBL
LigandPNGBDBM50260013(CHEMBL4070502)
Affinity DataIC50:  45nM. Assay description: Inhibition of recombinant human GST-tagged DDR1 catalytic domain expressed in baculovirus expression system using Fluorescein-Poly GAT as substrate m...
In DepthDetails ArticlePubMed
TargetBreakpoint cluster region protein/Tyrosine-protein kinase ABL1(Homo sapiens (Human))
Jinan University
Curated by ChEMBL
LigandPNGBDBM50260013(CHEMBL4070502)
Affinity DataIC50:  1.00E+4nM. Assay description: Binding affinity for cannabinoid receptor 2
In DepthDetails ArticlePubMed
TargetMast/stem cell growth factor receptor Kit(Homo sapiens (Human))
Jinan University
Curated by ChEMBL
LigandPNGBDBM50260013(CHEMBL4070502)
Affinity DataIC50: >1.00E+4nM. Assay description: Inhibition of recombinant human His-tagged c-kit cytoplasmic domain (544 to 976 residues) expressed in baculovirus expression system using Ser/Thr 6 ...
In DepthDetails ArticlePubMed
TargetDiscoidin domain-containing receptor 2(Homo sapiens (Human))
Jinan University
Curated by ChEMBL
LigandPNGBDBM50260013(CHEMBL4070502)
Affinity DataIC50:  1.40E+3nM. Assay description: Inhibition of recombinant human GST-tagged DDR2 cytoplasmic domain expressed in baculovirus expression system using Fluorescein-Poly GAT as substrate...
In DepthDetails ArticlePubMed