BDBM50260054 CHEMBL4087435
SMILES [Na+].[Na+].[Na+].[Na+].[O-]S(=O)(=O)Oc1ccc(cc1)-c1cc(=O)c2c(OCCOc3cc(OS([O-])(=O)=O)cc4oc(cc(=O)c34)-c3ccc(OS([O-])(=O)=O)cc3)cc(OS([O-])(=O)=O)cc2o1
InChI Key InChIKey=QBLHMLQELQZNCU-UHFFFAOYSA-J
Data  2 IC50
  Tab Delimited (TSV)   2D SDfile   Computed 3D by Vconf -m prep SDfile
Find this compound or compounds like it in BindingDB:
Activity Spreadsheet -- Enzyme Inhibition Constant Data from BindingDB
Found 2 hits for monomerid = 50260054
TargetNeutrophil elastase(Homo sapiens (Human))
Virginia Commonwealth University
Curated by ChEMBL
LigandPNGBDBM50260054(CHEMBL4087435)
Affinity DataIC50:  6.48E+4nM. Assay description: Inhibition of human neutrophil elastase using S1384 as substrate preincubated for 5 mins followed by substrate addition
In DepthDetails ArticlePubMed
TargetPlasminogen(Homo sapiens (Human))
Virginia Commonwealth University
Curated by ChEMBL
LigandPNGBDBM50260054(CHEMBL4087435)
Affinity DataIC50:  7.10E+4nM. Assay description: Allosteric inhibition of full length human plasmin by using chromogenic substrate spectrozyme PL preincubated for 5 mins followed by substrate additi...
In DepthDetails ArticlePubMed