BDBM50260514 (S)-N-(1-hydroxy-3,3-dimethylbutan-2-yl)-3-(2-morpholinoethyl)-2-oxo-2,3-dihydrobenzo[d]imidazole-1-carboxamide::CHEMBL522527
SMILES CC(C)(C)[C@@H](CO)NC(=O)n1c2ccccc2n(CCN2CCOCC2)c1=O
InChI Key InChIKey=FMGZEUZJWPJRHN-QGZVFWFLSA-N
Data  1 KI  1 IC50
  Tab Delimited (TSV)   2D SDfile   Computed 3D by Vconf -m prep SDfile
Find this compound or compounds like it in BindingDB:
Activity Spreadsheet -- Enzyme Inhibition Constant Data from BindingDB
Found 2 hits for monomerid = 50260514
TargetCannabinoid receptor 2(Homo sapiens (Human))
Pfizer
Curated by ChEMBL
LigandPNGBDBM50260514((S)-N-(1-hydroxy-3,3-dimethylbutan-2-yl)-3-(2-morp...)
Affinity DataKi:  15nM. Assay description: Displacement of [3H]CP-55940 from human CB2 receptor
In DepthDetails ArticlePubMed
TargetCannabinoid receptor 1(Homo sapiens (Human))
Pfizer
Curated by ChEMBL
LigandPNGBDBM50260514((S)-N-(1-hydroxy-3,3-dimethylbutan-2-yl)-3-(2-morp...)
Affinity DataIC50: >1.00E+4nM. Assay description: Displacement of [3H]SR141716A from human CB1 receptor
In DepthDetails ArticlePubMed