BDBM50260627 (S)-N-(1-amino-3,3-dimethyl-1-oxobutan-2-yl)-3-(2-morpholinoethyl)-2-oxo-2,3-dihydrobenzo[d]imidazole-1-carboxamide::CHEMBL523050
SMILES CC(C)(C)[C@H](NC(=O)n1c2ccccc2n(CCN2CCOCC2)c1=O)C(N)=O
InChI Key InChIKey=CGOMLRVFZYLLDP-MRXNPFEDSA-N
Data  1 KI  1 IC50
  Tab Delimited (TSV)   2D SDfile   Computed 3D by Vconf -m prep SDfile
Find this compound or compounds like it in BindingDB:
Activity Spreadsheet -- Enzyme Inhibition Constant Data from BindingDB
Found 2 hits for monomerid = 50260627
TargetCannabinoid receptor 2(Homo sapiens (Human))
Pfizer
Curated by ChEMBL
LigandPNGBDBM50260627((S)-N-(1-amino-3,3-dimethyl-1-oxobutan-2-yl)-3-(2-...)
Affinity DataKi:  5nM. Assay description: Displacement of [3H]CP-55940 from human CB2 receptor
In DepthDetails ArticlePubMed
TargetCannabinoid receptor 1(Homo sapiens (Human))
Pfizer
Curated by ChEMBL
LigandPNGBDBM50260627((S)-N-(1-amino-3,3-dimethyl-1-oxobutan-2-yl)-3-(2-...)
Affinity DataIC50: >1.00E+4nM. Assay description: Displacement of [3H]SR141716A from human CB1 receptor
In DepthDetails ArticlePubMed