BDBM50260795 3-(1-(4-chlorophenyl)cyclobutyl)-5-(3-fluoro-4-methoxyphenyl)-4-methyl-4H-1,2,4-triazole::CHEMBL496097
SMILES COc1ccc(cc1F)-c1nnc(n1C)C1(CCC1)c1ccc(Cl)cc1
InChI Key InChIKey=VMIACAXLJCXOQZ-UHFFFAOYSA-N
Data  4 IC50
  Tab Delimited (TSV)   2D SDfile   Computed 3D by Vconf -m prep SDfile
Find this compound or compounds like it in BindingDB:
Activity Spreadsheet -- Enzyme Inhibition Constant Data from BindingDB
Found 4 hits for monomerid = 50260795
Target11-beta-hydroxysteroid dehydrogenase 1(Homo sapiens (Human))
Merck Research Laboratories
Curated by ChEMBL
LigandPNGBDBM50260795(3-(1-(4-chlorophenyl)cyclobutyl)-5-(3-fluoro-4-met...)
Affinity DataIC50:  3nM. Assay description: Inhibition of human 11beta HSD1 by SPA assay
In DepthDetails ArticlePubMed
Target11-beta-hydroxysteroid dehydrogenase type 2(Mus musculus (mouse))
Merck Research Laboratories
Curated by ChEMBL
LigandPNGBDBM50260795(3-(1-(4-chlorophenyl)cyclobutyl)-5-(3-fluoro-4-met...)
Affinity DataIC50: >4.00E+3nM. Assay description: Inhibition of mouse 11beta HSD2
In DepthDetails ArticlePubMed
Target11-beta-hydroxysteroid dehydrogenase type 2(Homo sapiens (Human))
Merck Research Laboratories
Curated by ChEMBL
LigandPNGBDBM50260795(3-(1-(4-chlorophenyl)cyclobutyl)-5-(3-fluoro-4-met...)
Affinity DataIC50: >4.00E+3nM. Assay description: Inhibition of human 11beta HSD2
In DepthDetails ArticlePubMed
Target11-beta-hydroxysteroid dehydrogenase 1(Mus musculus (mouse))
Merck Research Laboratories
Curated by ChEMBL
LigandPNGBDBM50260795(3-(1-(4-chlorophenyl)cyclobutyl)-5-(3-fluoro-4-met...)
Affinity DataIC50:  42nM. Assay description: Inhibition of mouse 11beta HSD1 by SPA assay
In DepthDetails ArticlePubMed