BDBM50261163 CHEMBL4081756
SMILES Cc1cccc(n1)C(=O)N[C@H]1C[C@H](C1)n1cnc2c(NCc3cccc(Br)c3)ncnc12
InChI Key InChIKey=QYLYUTQSYHCBOD-HDICACEKSA-N
Data  7 IC50
  Tab Delimited (TSV)   2D SDfile   Computed 3D by Vconf -m prep SDfile
Find this compound or compounds like it in BindingDB:
Activity Spreadsheet -- Enzyme Inhibition Constant Data from BindingDB
Found 7 hits for monomerid = 50261163
TargetCyclin-dependent kinase 5 activator 1(Homo sapiens (Human))
Korea Research Institute Of Chemical Technology
Curated by ChEMBL
LigandPNGBDBM50261163(CHEMBL4081756)
Affinity DataIC50:  4.80nM. Assay description: Inhibition of CDK5/p35 (unknown origin) using ULingt-4E-BP as substrate after 1 hr in presence of ATP by fluorescence assay
In DepthDetails ArticlePubMed
TargetCyclin-dependent kinase/G2/mitotic-specific cyclin- 1(Homo sapiens (Human))
Korea Research Institute Of Chemical Technology
Curated by ChEMBL
LigandPNGBDBM50261163(CHEMBL4081756)
Affinity DataIC50:  24nM. Assay description: Inhibition of CDK5/p35 (unknown origin) using ULingt-4E-BP as substrate after 1 hr in presence of ATP by fluorescence assay
In DepthDetails ArticlePubMed
TargetCDK-activating kinase assembly factor MAT1/Cyclin-H/Cyclin-dependent kinase 7(Homo sapiens (Human))
Korea Research Institute Of Chemical Technology
Curated by ChEMBL
LigandPNGBDBM50261163(CHEMBL4081756)
Affinity DataIC50:  359nM. Assay description: Inhibition of CDK5/p35 (unknown origin) using ULingt-4E-BP as substrate after 1 hr in presence of ATP by fluorescence assay
In DepthDetails ArticlePubMed
TargetCyclin-A2/Cyclin-dependent kinase 2(Homo sapiens (Human))
Korea Research Institute Of Chemical Technology
Curated by ChEMBL
LigandPNGBDBM50261163(CHEMBL4081756)
Affinity DataIC50:  2.10nM. Assay description: Inhibition of CDK5/p35 (unknown origin) using ULingt-4E-BP as substrate after 1 hr in presence of ATP by fluorescence assay
In DepthDetails ArticlePubMed
TargetCyclin-dependent kinase 4/G1/S-specific cyclin-D3(Homo sapiens (Human))
Korea Research Institute Of Chemical Technology
Curated by ChEMBL
LigandPNGBDBM50261163(CHEMBL4081756)
Affinity DataIC50:  611nM. Assay description: Inhibition of CDK2/CyclinA (unknown origin) using ULingt-4E-BP as substrate after 1 hr in presence of ATP by fluorescence assay
In DepthDetails ArticlePubMed
TargetCyclin-T1/Cyclin-dependent kinase 9(Homo sapiens (Human))
Korea Research Institute Of Chemical Technology
Curated by ChEMBL
LigandPNGBDBM50261163(CHEMBL4081756)
Affinity DataIC50:  19nM. Assay description: Inhibition of CDK2/CyclinA (unknown origin) using ULingt-4E-BP as substrate after 1 hr in presence of ATP by fluorescence assay
In DepthDetails ArticlePubMed
TargetCyclin-dependent kinase 6/G1/S-specific cyclin-D3(Homo sapiens (Human))
Korea Research Institute Of Chemical Technology
Curated by ChEMBL
LigandPNGBDBM50261163(CHEMBL4081756)
Affinity DataIC50: >1.00E+3nM. Assay description: Inhibition of human CDK7/CyclinH/MAT1
In DepthDetails ArticlePubMed