BDBM50261722 9-(2-Hydroxy-4,4-dimethyl-6-oxocyclohexyl)-5-methoxy-3,3-dimethyl-2,3,4,9-tetrahydro-1H-xanthen-1-one::CHEMBL468847
SMILES COc1cccc2C(C3C(=O)CC(C)(C)CC3=O)C3=C(CC(C)(C)CC3=O)Oc12
InChI Key InChIKey=KVHBEPHKQYNMGH-UHFFFAOYSA-N
Data  1 KI
  Tab Delimited (TSV)   2D SDfile   Computed 3D by Vconf -m prep SDfile
Find this compound or compounds like it in BindingDB:
Activity Spreadsheet -- Enzyme Inhibition Constant Data from BindingDB
Found 1 hit for monomerid = 50261722
TargetNeuropeptide Y receptor type 5(Homo sapiens (Human))
Tsukuba Research Institute
Curated by ChEMBL
LigandPNGBDBM50261722(9-(2-Hydroxy-4,4-dimethyl-6-oxocyclohexyl)-5-metho...)
Affinity DataKi:  2.17E+3nM. Assay description: Displacement of [125I]PYY from human recombinant neuropeptide Y5 receptor expressed in thymidine kinase deficient human LM cells
In DepthDetails ArticlePubMed