BDBM50261897 6-Fluoro-9-(2-hydroxy-4,4-dimethyl-6-oxocyclohexyl)-3,3-dimethyl-2,3,4,9-tetrahydro-1H-xanthen-1-one::CHEMBL513701
SMILES CC1(C)CC(=O)C(C2C3=C(CC(C)(C)CC3=O)Oc3cc(F)ccc23)C(=O)C1
InChI Key InChIKey=KORHRHFPMDQJRT-UHFFFAOYSA-N
Data  1 KI  1 IC50
  Tab Delimited (TSV)   2D SDfile   Computed 3D by Vconf -m prep SDfile
Find this compound or compounds like it in BindingDB:
Activity Spreadsheet -- Enzyme Inhibition Constant Data from BindingDB
Found 2 hits for monomerid = 50261897
TargetNeuropeptide Y receptor type 5(Homo sapiens (Human))
Tsukuba Research Institute
Curated by ChEMBL
LigandPNGBDBM50261897(6-Fluoro-9-(2-hydroxy-4,4-dimethyl-6-oxocyclohexyl...)
Affinity DataKi:  29nM. Assay description: Displacement of [125I]PYY from human recombinant neuropeptide Y5 receptor expressed in thymidine kinase deficient human LM cells
In DepthDetails ArticlePubMed
TargetNeuropeptide Y receptor type 5(Homo sapiens (Human))
Tsukuba Research Institute
Curated by ChEMBL
LigandPNGBDBM50261897(6-Fluoro-9-(2-hydroxy-4,4-dimethyl-6-oxocyclohexyl...)
Affinity DataIC50:  63nM. Assay description: Antagonist activity at human recombinant neuropeptide Y5 receptor expressed in CHO cells coexpressing Gqi5 assessed as inhibition of neuropeptide Y-i...
In DepthDetails ArticlePubMed