BDBM50262037 5-(2-(4-hydroxy-3-nitrobenzylidene)hydrazinyl)-4-chloropyridazin-3(2H)-one::CHEMBL467372
SMILES Oc1ccc(CN=Nc2cn[nH]c(=O)c2Cl)cc1[N+]([O-])=O
InChI Key InChIKey=STQPWSCWNBVEBQ-UHFFFAOYSA-N
Data  1 IC50
  Tab Delimited (TSV)   2D SDfile   Computed 3D by Vconf -m prep SDfile
Find this compound or compounds like it in BindingDB:
Activity Spreadsheet -- Enzyme Inhibition Constant Data from BindingDB
Found 1 hit for monomerid = 50262037
TargetDNA ligase 1(Homo sapiens (Human))
University Of Maryland
Curated by ChEMBL
LigandPNGBDBM50262037(5-(2-(4-hydroxy-3-nitrobenzylidene)hydrazinyl)-4-c...)
Affinity DataIC50:  1.20E+4nM. Assay description: Inhibition of human recombinant DNA ligase 1 by radioactive gel-based ligation assay
In DepthDetails ArticlePubMed