BDBM50262625 CHEMBL476312::N-Biphenyl-2-ylmethyl-N-(S)-pyrrolidin-3-yl-methanesulfonamide
SMILES CS(=O)(=O)N(Cc1ccccc1-c1ccccc1)[C@H]1CCNC1
InChI Key InChIKey=HUGQKIWTNMQGCP-KRWDZBQOSA-N
Data  4 KI  4 IC50
  Tab Delimited (TSV)   2D SDfile   Computed 3D by Vconf -m prep SDfile
Find this compound or compounds like it in BindingDB:
Activity Spreadsheet -- Enzyme Inhibition Constant Data from BindingDB
Found 8 hits for monomerid = 50262625
TargetSodium-dependent noradrenaline transporter(Homo sapiens (Human))
Pfizer
Curated by ChEMBL
LigandPNGBDBM50262625(CHEMBL476312 | N-Biphenyl-2-ylmethyl-N-(S)-pyrroli...)
Affinity DataKi:  5nM. Assay description: Inhibition of [3H]nisoxetine reuptake at human NET expressed in HEK293 cells by SPA
In DepthDetails ArticlePubMed
TargetSodium-dependent dopamine transporter(Homo sapiens (Human))
Pfizer
Curated by ChEMBL
LigandPNGBDBM50262625(CHEMBL476312 | N-Biphenyl-2-ylmethyl-N-(S)-pyrroli...)
Affinity DataKi:  2.67E+3nM. Assay description: Inhibition of [3H]dopamine reuptake at human DAT expressed in HEK293 cells by SPA
In DepthDetails ArticlePubMed
TargetPotassium voltage-gated channel subfamily H member 2(Homo sapiens (Human))
Pfizer
Curated by ChEMBL
LigandPNGBDBM50262625(CHEMBL476312 | N-Biphenyl-2-ylmethyl-N-(S)-pyrroli...)
Affinity DataKi: >2.70E+3nM. Assay description: Displacement of [3H]dofetilide from human ERG channel
In DepthDetails ArticlePubMed
TargetSodium-dependent serotonin transporter(Homo sapiens (Human))
Pfizer
Curated by ChEMBL
LigandPNGBDBM50262625(CHEMBL476312 | N-Biphenyl-2-ylmethyl-N-(S)-pyrroli...)
Affinity DataKi:  4.12E+3nM. Assay description: Inhibition of [3H]citalopram uptake at human 5HTT expressed in HEK293 cells by SPA
In DepthDetails ArticlePubMed
TargetCytochrome P450 2D6(Homo sapiens (Human))
Pfizer
Curated by ChEMBL
LigandPNGBDBM50262625(CHEMBL476312 | N-Biphenyl-2-ylmethyl-N-(S)-pyrroli...)
Affinity DataIC50:  3.10E+3nM. Assay description: Inhibition of CYP2D6 (unknown origin)
In DepthDetails ArticlePubMed
TargetCytochrome P450 1A2(Homo sapiens (Human))
Pfizer
Curated by ChEMBL
LigandPNGBDBM50262625(CHEMBL476312 | N-Biphenyl-2-ylmethyl-N-(S)-pyrroli...)
Affinity DataIC50: >3.00E+3nM. Assay description: Inhibition of CYP1A2 (unknown origin)
In DepthDetails ArticlePubMed
TargetCytochrome P450 3A4(Homo sapiens (Human))
Pfizer
Curated by ChEMBL
LigandPNGBDBM50262625(CHEMBL476312 | N-Biphenyl-2-ylmethyl-N-(S)-pyrroli...)
Affinity DataIC50: >3.00E+3nM. Assay description: Inhibition of CYP3A4 (unknown origin)
In DepthDetails ArticlePubMed
TargetCytochrome P450 2C9(Homo sapiens (Human))
Pfizer
Curated by ChEMBL
LigandPNGBDBM50262625(CHEMBL476312 | N-Biphenyl-2-ylmethyl-N-(S)-pyrroli...)
Affinity DataIC50: >3.00E+3nM. Assay description: Inhibition of CYP2C9 (unknown origin)
In DepthDetails ArticlePubMed