BDBM50263188 2-butoxy-9-(2,6-difluorobenzyl)-N-(2-morpholin-4-ylethyl)-9H-purin-6-amine::9-(2,6-difluorobenzyl)-2-butoxy-N-(2-morpholinoethyl)-9H-purin-6-amine::CHEMBL515774
SMILES CCCCOc1nc(NCCN2CCOCC2)c2ncn(Cc3c(F)cccc3F)c2n1
InChI Key InChIKey=UGZWPZWADDDTRN-UHFFFAOYSA-N
Data  1 IC50
PDB links: 1 PDB ID matches this monomer.
  Tab Delimited (TSV)   2D SDfile   Computed 3D by Vconf -m prep SDfile
Find this compound or compounds like it in BindingDB:
Activity Spreadsheet -- Enzyme Inhibition Constant Data from BindingDB
Found 1 hit for monomerid = 50263188
TargetGlutamate racemase(Enterococcus faecalis)
Astrazeneca R&D Boston
Curated by ChEMBL
LigandPNGBDBM50263188(2-butoxy-9-(2,6-difluorobenzyl)-N-(2-morpholin-4-y...)
Affinity DataIC50:  5.80E+3nM. Assay description: Inhibition of Enterococcus faecalis MurI