BDBM50263195 4-(4,6-Dimethyl-1-octylindolin-7-yl)carbamoyl-4-methylpentanoic Acid::CHEMBL478014
SMILES CCCCCCCCN1CCc2c1c(NC(=O)C(C)(C)CCC(O)=O)c(C)cc2C
InChI Key InChIKey=NEQHFLHCAZXFPF-UHFFFAOYSA-N
Data  1 IC50
  Tab Delimited (TSV)   2D SDfile   Computed 3D by Vconf -m prep SDfile
Find this compound or compounds like it in BindingDB:
Activity Spreadsheet -- Enzyme Inhibition Constant Data from BindingDB
Found 1 hit for monomerid = 50263195
TargetSterol O-acyltransferase 1(Homo sapiens (Human))
Kyoto Pharmaceutical Industries
Curated by ChEMBL
LigandPNGBDBM50263195(4-(4,6-Dimethyl-1-octylindolin-7-yl)carbamoyl-4-me...)
Affinity DataIC50: >1.00E+4nM. Assay description: Inhibition of ACAT-mediated esterified cholesterol accumulation in human THP1 cells exposed to acetyl-LDL during differentiation assessed as effect o...
In DepthDetails ArticlePubMed