BDBM50263386 CHEMBL443967::H-Arg-N-Me-Arg-Pro-Tyr-Ile-Leu-OH
SMILES [#6]-[#6]-[#6@H](-[#6])-[#6@H](-[#7]-[#6](=O)-[#6@H](-[#6]-c1ccc(-[#8])cc1)-[#7]-[#6](=O)-[#6@@H]-1-[#6]-[#6]-[#6]-[#7]-1-[#6](=O)-[#6@H](-[#6]-[#6]-[#6]\[#7]=[#6](\[#7])-[#7])-[#7](-[#6])-[#6](=O)-[#6@@H](-[#7])-[#6]-[#6]-[#6]\[#7]=[#6](/[#7])-[#7])-[#6](=O)-[#7]-[#6@@H](-[#6]-[#6](-[#6])-[#6])-[#6](-[#8])=O
InChI Key InChIKey=FMWPNVFPKCUWHA-VGPFALITSA-N
Data  1 KI
  Tab Delimited (TSV)   2D SDfile   Computed 3D by Vconf -m prep SDfile
Find this compound or compounds like it in BindingDB:
Activity Spreadsheet -- Enzyme Inhibition Constant Data from BindingDB
Found 1 hit for monomerid = 50263386
TargetNeurotensin receptor type 1(Homo sapiens (Human))
Friedrich-Alexander University
Curated by ChEMBL
LigandPNGBDBM50263386(CHEMBL443967 | H-Arg-N-Me-Arg-Pro-Tyr-Ile-Leu-OH)
Affinity DataKi:  0.510nM. Assay description: Displacement of [3H]NT(8-13) from wild type human NTR1 expressed in HEK293 cells
In DepthDetails ArticlePubMed