BDBM50263456 2-hydroxy-9-(4-(methoxymethyl)phenyl)-6,11-dihydro-5H-benzo[a]carbazole-3-carboxylic acid::CHEMBL479082
SMILES COCc1ccc(cc1)-c1ccc2c3CCc4cc(C(O)=O)c(O)cc4-c3[nH]c2c1
InChI Key InChIKey=JFLMBIQWEWWTSI-UHFFFAOYSA-N
Data  1 EC50
  Tab Delimited (TSV)   2D SDfile   Computed 3D by Vconf -m prep SDfile
Find this compound or compounds like it in BindingDB:
Activity Spreadsheet -- Enzyme Inhibition Constant Data from BindingDB
Found 1 hit for monomerid = 50263456
TargetThrombopoietin receptor(Homo sapiens (Human))
Genomics Institute Of The Novartis Research Foundation
Curated by ChEMBL
LigandPNGBDBM50263456(2-hydroxy-9-(4-(methoxymethyl)phenyl)-6,11-dihydro...)
Affinity DataEC50:  452nM. Assay description: Agonist activity at human thrombopoietin receptor in Ba/F3 cells assessed as activation of Stat5 response element-driven reporter gene expression
In DepthDetails ArticlePubMed