BDBM50263533 CHEMBL455343::N-(3-(2-(4-hydroxyphenylamino)pyrimidin-4-yl)phenyl)acetamide
SMILES CC(=O)Nc1cccc(c1)-c1ccnc(Nc2ccc(O)cc2)n1
InChI Key InChIKey=VQMXEYMHISITRF-UHFFFAOYSA-N
Data  1 IC50
  Tab Delimited (TSV)   2D SDfile   Computed 3D by Vconf -m prep SDfile
Find this compound or compounds like it in BindingDB:
Activity Spreadsheet -- Enzyme Inhibition Constant Data from BindingDB
Found 1 hit for monomerid = 50263533
TargetSerine/threonine-protein kinase PLK1(Homo sapiens (Human))
Sichuan University
Curated by ChEMBL
LigandPNGBDBM50263533(CHEMBL455343 | N-(3-(2-(4-hydroxyphenylamino)pyrim...)
Affinity DataIC50:  6.90E+3nM. Assay description: Inhibition of PLK1 (unknown origin)
In DepthDetails ArticlePubMed