BDBM50263602 CHEMBL453138::N-[2-(3-phenyl-7-methoxynaphth-1-yl)ethyl] acetamide
SMILES COc1ccc2cc(cc(CCNC(C)=O)c2c1)-c1ccccc1
InChI Key InChIKey=YJZBNOXVCJWRGJ-UHFFFAOYSA-N
Data  2 KI  1 EC50
  Tab Delimited (TSV)   2D SDfile   Computed 3D by Vconf -m prep SDfile
Find this compound or compounds like it in BindingDB:
Activity Spreadsheet -- Enzyme Inhibition Constant Data from BindingDB
Found 3 hits for monomerid = 50263602
TargetMelatonin receptor type 1B(Homo sapiens (Human))
University Of Lille 2
Curated by ChEMBL
LigandPNGBDBM50263602(CHEMBL453138 | N-[2-(3-phenyl-7-methoxynaphth-1-yl...)
Affinity DataKi:  0.370nM. Assay description: Displacement of 2-[125I]iodomelatonin from human MT2 receptor expressed in CHO cells
In DepthDetails ArticlePubMed
TargetMelatonin receptor type 1A(Homo sapiens (Human))
University Of Lille 2
Curated by ChEMBL
LigandPNGBDBM50263602(CHEMBL453138 | N-[2-(3-phenyl-7-methoxynaphth-1-yl...)
Affinity DataKi:  53nM. Assay description: Displacement of 2-[125I]iodomelatonin from human MT1 receptor expressed in HEK293 cells
In DepthDetails ArticlePubMed
TargetMelatonin receptor type 1B(Homo sapiens (Human))
University Of Lille 2
Curated by ChEMBL
LigandPNGBDBM50263602(CHEMBL453138 | N-[2-(3-phenyl-7-methoxynaphth-1-yl...)
Affinity DataEC50:  2.40nM. Assay description: Agonist activity at human MT2 receptor expressed in CHO cells by [35S]GTPgammaS binding assay
In DepthDetails ArticlePubMed