BDBM50263668 2-Cyano-4-[2-(1-methyl-piperidin-4-yl)-ethoxy]-6-[(spiro[2.5]oct-6-ylmethyl)-amino]-pyrimidine-5-carboxylic acid methylamide::CHEMBL514545
SMILES CNC(=O)c1c(NCC2CCC3(CC3)CC2)nc(nc1OCCC1CCN(C)CC1)C#N
InChI Key InChIKey=PFNHYFHJCWNICY-UHFFFAOYSA-N
Data  2 IC50
  Tab Delimited (TSV)   2D SDfile   Computed 3D by Vconf -m prep SDfile
Find this compound or compounds like it in BindingDB:
Activity Spreadsheet -- Enzyme Inhibition Constant Data from BindingDB
Found 2 hits for monomerid = 50263668
TargetCathepsin S(Homo sapiens (Human))
Novartis Institutes For Biomedical Research
Curated by ChEMBL
LigandPNGBDBM50263668(2-Cyano-4-[2-(1-methyl-piperidin-4-yl)-ethoxy]-6-[...)
Affinity DataIC50:  2nM. Assay description: Inhibition of human recombinant cathepsin S by fluorometric assay
In DepthDetails ArticlePubMed
TargetProcathepsin L(Homo sapiens (Human))
Novartis Institutes For Biomedical Research
Curated by ChEMBL
LigandPNGBDBM50263668(2-Cyano-4-[2-(1-methyl-piperidin-4-yl)-ethoxy]-6-[...)
Affinity DataIC50:  120nM. Assay description: Inhibition of human recombinant cathepsin L by fluorometric assay
In DepthDetails ArticlePubMed