BDBM50263839 CHEMBL4102353
SMILES CC[C@H](C)[C@@H]1NC(=O)[C@@H]2CCCN2C(=O)[C@H](Cc2c[nH]c3ccccc23)N(C)C(=O)[C@H](CCCNC(N)=N)N(C)C(=O)[C@@H](Cc2ccccc2)NC(=O)[C@H](Cc2cnc[nH]2)NC(=O)[C@@H](NC(=O)[C@@H]2CSSC[C@H](NC1=O)C(=O)N[C@@H](Cc1ccccc1)C(=O)N1CCC[C@H]1C(=O)N[C@@H](CC(O)=O)C(=O)NCC(=O)N[C@@H](CCCNC(N)=N)C(=O)N2)[C@@H](C)O
InChI Key InChIKey=XZYFGXZTMWAXRL-QKVZEHDSSA-N
Data  3 KI  1 IC50  4 EC50
  Tab Delimited (TSV)   2D SDfile   Computed 3D by Vconf -m prep SDfile
Find this compound or compounds like it in BindingDB:
Activity Spreadsheet -- Enzyme Inhibition Constant Data from BindingDB
Found 8 hits for monomerid = 50263839
TargetMelanocyte-stimulating hormone receptor(Homo sapiens (Human))
The University Of Queensland
Curated by ChEMBL
LigandPNGBDBM50263839(CHEMBL4102353)
Affinity DataKi:  219nM. Assay description: Displacement of [125I]-NDP-alpha-MSH from human MC1R LBD expressed in HEK293 cell membranes incubated for 16 to 23 hrs in dark by scintillation proxi...
In DepthDetails ArticlePubMed
TargetMelanocortin receptor 4(Homo sapiens (Human))
The University Of Queensland
Curated by ChEMBL
LigandPNGBDBM50263839(CHEMBL4102353)
Affinity DataKi: <1.00E+3nM. Assay description: Displacement of [125I]-NDP-alpha-MSH from human MC4R LBD expressed in HEK293 cell membranes incubated for 16 to 23 hrs in dark by scintillation proxi...
In DepthDetails ArticlePubMed
TargetMelanocortin receptor 3(Homo sapiens (Human))
The University Of Queensland
Curated by ChEMBL
LigandPNGBDBM50263839(CHEMBL4102353)
Affinity DataKi: <1.00E+5nM. Assay description: Displacement of [125I]-NDP-alpha-MSH from human MC3R LBD expressed in HEK293 cell membranes incubated for 16 to 23 hrs in dark by scintillation proxi...
In DepthDetails ArticlePubMed
TargetMelanocortin receptor 3(Homo sapiens (Human))
The University Of Queensland
Curated by ChEMBL
LigandPNGBDBM50263839(CHEMBL4102353)
Affinity DataEC50: <1.00E+3nM. Assay description: Agonist activity at human MC3R expressed in low doxycyclin-treated HEK293 cell membranes assessed as increase in cAMP production after 45 mins by HTR...
In DepthDetails ArticlePubMed
TargetMelanocortin receptor 4(Homo sapiens (Human))
The University Of Queensland
Curated by ChEMBL
LigandPNGBDBM50263839(CHEMBL4102353)
Affinity DataEC50:  479nM. Assay description: Agonist activity at human MC4R expressed in high doxycyclin-treated HEK293 cell membranes assessed as increase in cAMP production after 15 mins by HT...
In DepthDetails ArticlePubMed
TargetMelanocortin receptor 4(Homo sapiens (Human))
The University Of Queensland
Curated by ChEMBL
LigandPNGBDBM50263839(CHEMBL4102353)
Affinity DataEC50: <1.00E+3nM. Assay description: Agonist activity at human MC4R expressed in low doxycyclin-treated HEK293 cell membranes assessed as increase in cAMP production after 45 mins by HTR...
In DepthDetails ArticlePubMed
TargetMelanocortin receptor 5(Homo sapiens (Human))
The University Of Queensland
Curated by ChEMBL
LigandPNGBDBM50263839(CHEMBL4102353)
Affinity DataIC50: <1.00E+3nM. Assay description: Displacement of [125I]-NDP-alpha-MSH from human MC5R LBD expressed in HEK293 cell membranes incubated for 16 to 23 hrs in dark by scintillation proxi...
In DepthDetails ArticlePubMed
TargetMelanocyte-stimulating hormone receptor(Homo sapiens (Human))
The University Of Queensland
Curated by ChEMBL
LigandPNGBDBM50263839(CHEMBL4102353)
Affinity DataEC50:  38nM. Assay description: Agonist activity at human MC1R expressed in low doxycyclin-treated HEK293 cell membranes assessed as increase in cAMP production after 45 mins by HTR...
In DepthDetails ArticlePubMed