BDBM50264447 CHEMBL523266::[1-(1-Benzyl-1H-benzoimidazole-2-carbonyl)-piperidin-4-yl]-(4-pyridin-4-yl-piperazin-1-yl)-methanone
SMILES O=C(C1CCN(CC1)C(=O)c1nc2ccccc2n1Cc1ccccc1)N1CCN(CC1)c1ccncc1
InChI Key InChIKey=JTXJODQXRHMMBE-UHFFFAOYSA-N
Data  1 IC50
  Tab Delimited (TSV)   2D SDfile   Computed 3D by Vconf -m prep SDfile
Find this compound or compounds like it in BindingDB:
Activity Spreadsheet -- Enzyme Inhibition Constant Data from BindingDB
Found 1 hit for monomerid = 50264447
TargetB1 bradykinin receptor(Macaca fascicularis)
Neurogen
Curated by ChEMBL
LigandPNGBDBM50264447(CHEMBL523266 | [1-(1-Benzyl-1H-benzoimidazole-2-ca...)
Affinity DataIC50:  2.31E+3nM. Assay description: Antagonist activity at Cynomolgus monkey bradykinin B1 receptor expressed in CHO cells assessed as calcium transient by FLIPR assay
In DepthDetails ArticlePubMed