BDBM50264538 (S)-2-Ethoxy-3-(3-(4,5-dihydro-5-phenethylisoxazol-3-yl)phenyl)propanoic Acid::CHEMBL484263
SMILES CCO[C@@H](Cc1cccc(c1)C1=NOC(CCc2ccccc2)C1)C(O)=O
InChI Key InChIKey=HAMXNMHJIWXEJM-QWAKEFERSA-N
Data  2 EC50
  Tab Delimited (TSV)   2D SDfile   Computed 3D by Vconf -m prep SDfile
Find this compound or compounds like it in BindingDB:
Activity Spreadsheet -- Enzyme Inhibition Constant Data from BindingDB
Found 2 hits for monomerid = 50264538
TargetPeroxisome proliferator-activated receptor alpha(Homo sapiens (Human))
Seoul National University
Curated by ChEMBL
LigandPNGBDBM50264538((S)-2-Ethoxy-3-(3-(4,5-dihydro-5-phenethylisoxazol...)
Affinity DataEC50:  3.08E+3nM. Assay description: Agonist activity at human PPARalpha ligand binding domain expressed in african green monkey CV1 cells co-transfected with fused Gal4-DBD by transacti...
In DepthDetails ArticlePubMed
TargetPeroxisome proliferator-activated receptor gamma(Homo sapiens (Human))
Seoul National University
Curated by ChEMBL
LigandPNGBDBM50264538((S)-2-Ethoxy-3-(3-(4,5-dihydro-5-phenethylisoxazol...)
Affinity DataEC50:  1.85E+3nM. Assay description: Agonist activity at human PPARgamma ligand binding domain expressed in african green monkey CV1 cells co-transfected with fused Gal4-DBD by transacti...
In DepthDetails ArticlePubMed