BDBM50264755 4-methyl-N-(3-morpholin-4-ylphenyl)-3-(3-piperidin-4-yl-1,2-benzisoxazol-6-yl)benzamide::4-methyl-N-(3-morpholinophenyl)-3-(3-(piperidin-4-yl)benzo[d]isoxazol-6-yl)benzamide::CHEMBL485285
SMILES Cc1ccc(cc1-c1ccc2c(noc2c1)C1CCNCC1)C(=O)Nc1cccc(c1)N1CCOCC1
InChI Key InChIKey=UVUGBBNUQBSROH-UHFFFAOYSA-N
Data  1 KI  10 IC50
PDB links: 1 PDB ID matches this monomer.
  Tab Delimited (TSV)   2D SDfile   Computed 3D by Vconf -m prep SDfile
Find this compound or compounds like it in BindingDB:
Activity Spreadsheet -- Enzyme Inhibition Constant Data from BindingDB
Found 11 hits for monomerid = 50264755
TargetMitogen-activated protein kinase 14(Homo sapiens (Human))
Glaxosmithkline
Curated by ChEMBL
LigandPNGBDBM50264755(4-methyl-N-(3-morpholin-4-ylphenyl)-3-(3-piperidin...)
Affinity DataKi:  1.40nM. Assay description: Displacement of fluorescent ATP competitive ligand from p38alpha
TargetCyclin-dependent kinase 2(Homo sapiens (Human))
Glaxosmithkline
Curated by ChEMBL
LigandPNGBDBM50264755(4-methyl-N-(3-morpholin-4-ylphenyl)-3-(3-piperidin...)
Affinity DataIC50: >2.00E+4nM. Assay description: Inhibition of CDK2
In DepthDetails ArticlePubMed
TargetMacrophage colony-stimulating factor 1 receptor(Homo sapiens (Human))
Glaxosmithkline
Curated by ChEMBL
LigandPNGBDBM50264755(4-methyl-N-(3-morpholin-4-ylphenyl)-3-(3-piperidin...)
Affinity DataIC50: >2.00E+4nM. Assay description: Inhibition of cFMS
In DepthDetails ArticlePubMed
TargetEpidermal growth factor receptor(Homo sapiens (Human))
Glaxosmithkline
Curated by ChEMBL
LigandPNGBDBM50264755(4-methyl-N-(3-morpholin-4-ylphenyl)-3-(3-piperidin...)
Affinity DataIC50: >2.50E+4nM. Assay description: Inhibition of EGFR
In DepthDetails ArticlePubMed
TargetVascular endothelial growth factor receptor 2(Homo sapiens (Human))
Glaxosmithkline
Curated by ChEMBL
LigandPNGBDBM50264755(4-methyl-N-(3-morpholin-4-ylphenyl)-3-(3-piperidin...)
Affinity DataIC50: >2.00E+4nM. Assay description: Inhibition of VEGFR2
In DepthDetails ArticlePubMed
TargetMitogen-activated protein kinase 10(Homo sapiens (Human))
Glaxosmithkline
Curated by ChEMBL
LigandPNGBDBM50264755(4-methyl-N-(3-morpholin-4-ylphenyl)-3-(3-piperidin...)
Affinity DataIC50: >1.60E+4nM. Assay description: Inhibition of JNK3
In DepthDetails ArticlePubMed
TargetTyrosine-protein kinase Lck(Homo sapiens (Human))
Glaxosmithkline
Curated by ChEMBL
LigandPNGBDBM50264755(4-methyl-N-(3-morpholin-4-ylphenyl)-3-(3-piperidin...)
Affinity DataIC50:  8.00E+3nM. Assay description: Inhibition of LCK
In DepthDetails ArticlePubMed
TargetSerine/threonine-protein kinase PLK1(Homo sapiens (Human))
Glaxosmithkline
Curated by ChEMBL
LigandPNGBDBM50264755(4-methyl-N-(3-morpholin-4-ylphenyl)-3-(3-piperidin...)
Affinity DataIC50: >2.50E+4nM. Assay description: Inhibition of PLK1
In DepthDetails ArticlePubMed
TargetSerine/threonine-protein kinase Sgk1(Homo sapiens (Human))
Glaxosmithkline
Curated by ChEMBL
LigandPNGBDBM50264755(4-methyl-N-(3-morpholin-4-ylphenyl)-3-(3-piperidin...)
Affinity DataIC50: >3.30E+4nM. Assay description: Inhibition of SGK1
In DepthDetails ArticlePubMed
TargetDual specificity mitogen-activated protein kinase kinase 1(Homo sapiens (Human))
Glaxosmithkline
Curated by ChEMBL
LigandPNGBDBM50264755(4-methyl-N-(3-morpholin-4-ylphenyl)-3-(3-piperidin...)
Affinity DataIC50:  40nM. Assay description: Inhibition of MEK1 by cRaf/mek/Erk cascade assay
In DepthDetails ArticlePubMed
TargetReceptor tyrosine-protein kinase erbB-4(Homo sapiens (Human))
Glaxosmithkline
Curated by ChEMBL
LigandPNGBDBM50264755(4-methyl-N-(3-morpholin-4-ylphenyl)-3-(3-piperidin...)
Affinity DataIC50: >2.50E+4nM. Assay description: Inhibition of ErbB4
In DepthDetails ArticlePubMed