BDBM50264898 (4-(4-methoxyphenyl)piperazin-1-yl)(2-morpholino-5-nitrophenyl)methanone::CHEMBL497770
SMILES COc1ccc(cc1)N1CCN(CC1)C(=O)c1cc(ccc1N1CCOCC1)[N+]([O-])=O
InChI Key InChIKey=ARXNIOQXGVZLSL-UHFFFAOYSA-N
Data  2 EC50
  Tab Delimited (TSV)   2D SDfile   Computed 3D by Vconf -m prep SDfile
Find this compound or compounds like it in BindingDB:
Activity Spreadsheet -- Enzyme Inhibition Constant Data from BindingDB
Found 2 hits for monomerid = 50264898
TargetSodium- and chloride-dependent glycine transporter 2(Homo sapiens (Human))
F. Hoffmann-La Roche
Curated by ChEMBL
LigandPNGBDBM50264898((4-(4-methoxyphenyl)piperazin-1-yl)(2-morpholino-5...)
Affinity DataEC50:  1.14E+4nM. Assay description: Inhibition of [3H]glycine uptake at human glycine transporter 2 expressed in CHO cells by scintillation counter
In DepthDetails ArticlePubMed
TargetSodium- and chloride-dependent glycine transporter 1(Homo sapiens (Human))
F. Hoffmann-La Roche
Curated by ChEMBL
LigandPNGBDBM50264898((4-(4-methoxyphenyl)piperazin-1-yl)(2-morpholino-5...)
Affinity DataEC50:  1.30E+3nM. Assay description: Inhibition of [3H]glycine uptake at human glycine transporter 1 expressed in CHO cells by scintillation counter
In DepthDetails ArticlePubMed