BDBM50264902 4-(6-(pyridin-3-ylmethylamino)imidazo[1,2-b]pyridazin-3-yl)benzonitrile::CHEMBL450347
SMILES N#Cc1ccc(cc1)-c1cnc2ccc(NCc3cccnc3)nn12
InChI Key InChIKey=IFIPOWAFURAJLX-UHFFFAOYSA-N
Data  2 IC50
  Tab Delimited (TSV)   2D SDfile   Computed 3D by Vconf -m prep SDfile
Find this compound or compounds like it in BindingDB:
Activity Spreadsheet -- Enzyme Inhibition Constant Data from BindingDB
Found 2 hits for monomerid = 50264902
TargetProtein kinase domain-containing protein(Plasmodium falciparum)TBA
LigandPNGBDBM50264902(4-(6-(pyridin-3-ylmethylamino)imidazo[1,2-b]pyrida...)
Affinity DataIC50:  809nM. Assay description: Inhibition of Plasmodium falciparum protein kinase 7
In DepthDetails Article
TargetProtein kinase domain-containing protein(Plasmodium falciparum)TBA
LigandPNGBDBM50264902(4-(6-(pyridin-3-ylmethylamino)imidazo[1,2-b]pyrida...)
Affinity DataIC50:  810nM. Assay description: Inhibition of Plasmodium falciparum PK7
In DepthDetails ArticlePubMed