BDBM50264987 9-(4-Butyl-phenyl)-5,5-dioxo-6,11-dihydro-5H-5lambda*6*-thia-11-aza-benzo[a]fluorene-3-carboxylic acid::CHEMBL497372
SMILES CCCCc1ccc(cc1)-c1ccc2c3CS(=O)(=O)c4cc(ccc4-c3[nH]c2c1)C(O)=O
InChI Key InChIKey=JFRGHJKPPPGAGT-UHFFFAOYSA-N
Data  1 EC50
  Tab Delimited (TSV)   2D SDfile   Computed 3D by Vconf -m prep SDfile
Find this compound or compounds like it in BindingDB:
Activity Spreadsheet -- Enzyme Inhibition Constant Data from BindingDB
Found 1 hit for monomerid = 50264987
TargetThrombopoietin receptor(Homo sapiens (Human))
Genomics Institute Of The Novartis Research Foundation
Curated by ChEMBL
LigandPNGBDBM50264987(9-(4-Butyl-phenyl)-5,5-dioxo-6,11-dihydro-5H-5lamb...)
Affinity DataEC50:  449nM. Assay description: Agonist activity at human thrombopoietin receptor expressed in mouse Ba/F3 cells by kinase activation based reporter gene assay
In DepthDetails ArticlePubMed