BDBM50265066 4-(6-(4-butylphenyl)-7-fluoro-3-isopropyl-1H-indol-2-yl)-2-hydroxybenzoic acid::CHEMBL497348
SMILES CCCCc1ccc(cc1)-c1ccc2c(C(C)C)c([nH]c2c1F)-c1ccc(C(O)=O)c(O)c1
InChI Key InChIKey=AXCOYOPUGNEVTQ-UHFFFAOYSA-N
Data  1 EC50
  Tab Delimited (TSV)   2D SDfile   Computed 3D by Vconf -m prep SDfile
Find this compound or compounds like it in BindingDB:
Activity Spreadsheet -- Enzyme Inhibition Constant Data from BindingDB
Found 1 hit for monomerid = 50265066
TargetThrombopoietin receptor(Homo sapiens (Human))
Genomics Institute Of The Novartis Research Foundation
Curated by ChEMBL
LigandPNGBDBM50265066(4-(6-(4-butylphenyl)-7-fluoro-3-isopropyl-1H-indol...)
Affinity DataEC50: >1.00E+3nM. Assay description: Agonist activity at human thrombopoietin receptor expressed in mouse Ba/F3 cells by kinase activation based reporter gene assay
In DepthDetails ArticlePubMed