BDBM50265070 3-(2-amino-4-oxo-3,4-dihydroquinazolin-6-yl)-N-cyclopropyl-4-methylbenzamide::CHEMBL496313
SMILES Cc1ccc(cc1-c1ccc2nc(N)[nH]c(=O)c2c1)C(=O)NC1CC1
InChI Key InChIKey=ARHWJQAVEJWQCM-UHFFFAOYSA-N
Data  1 KI
  Tab Delimited (TSV)   2D SDfile   Computed 3D by Vconf -m prep SDfile
Find this compound or compounds like it in BindingDB:
Activity Spreadsheet -- Enzyme Inhibition Constant Data from BindingDB
Found 1 hit for monomerid = 50265070
TargetMitogen-activated protein kinase 14(Homo sapiens (Human))
Glaxosmithkline
Curated by ChEMBL
LigandPNGBDBM50265070(3-(2-amino-4-oxo-3,4-dihydroquinazolin-6-yl)-N-cyc...)
Affinity DataKi:  49nM. Assay description: Displacement of fluorescent ATP competitive ligand from p38alpha
In DepthDetails ArticlePubMed