BDBM50265228 3-(3-((4-(4-(2-chloro-5-((2S,3R,4R,5S,6R)-3,4,5-trihydroxy-6-(hydroxymethyl)tetrahydro-2H-pyran-2-yl)benzyl)phenoxy)butyl)(isopropyl)amino)-3-oxopropyl)-5,5-difluoro-7,9-dimethyl-5H-dipyrrolo[1,2-c:1',2'-f][1,3,2]diazaborinin-4-ium-5-uide::CHEMBL509278
SMILES CC(C)N(CCCCOc1ccc(Cc2cc(ccc2Cl)[C@@H]2O[C@H](CO)[C@@H](O)[C@H](O)[C@H]2O)cc1)C(=O)CCC1=[N+]2C(C=C1)=Cc1c(C)cc(C)n1[B-]2(F)F
InChI Key InChIKey=TZVUGYKFGVQQDB-PIOUWGHTSA-N
Data  1 IC50
  Tab Delimited (TSV)   2D SDfile   Computed 3D by Vconf -m prep SDfile
Find this compound or compounds like it in BindingDB:
Activity Spreadsheet -- Enzyme Inhibition Constant Data from BindingDB
Found 1 hit for monomerid = 50265228
TargetSodium/glucose cotransporter 2(Homo sapiens (Human))
Pfizer
Curated by ChEMBL
LigandPNGBDBM50265228(3-(3-((4-(4-(2-chloro-5-((2S,3R,4R,5S,6R)-3,4,5-tr...)
Affinity DataIC50:  1.57E+3nM. Assay description: Inhibition of human SGLT2 expressed in CHO cells assessed as [14C]-alpha-methyl-D-glucopyranoside uptake by fluorescence polarization assay
In DepthDetails ArticlePubMed