BDBM50265339 CHEMBL497786::N-(2-(3-oxo-3H-spiro[isobenzofuran-1,4'-piperidine]-1'-yl)-1H-benzo[d]imidazol-5-yl)acetamide
SMILES CC(=O)Nc1ccc2nc([nH]c2c1)N1CCC2(CC1)OC(=O)c1ccccc21
InChI Key InChIKey=XVVDQYOZEAHZMG-UHFFFAOYSA-N
Data  1 IC50
  Tab Delimited (TSV)   2D SDfile   Computed 3D by Vconf -m prep SDfile
Find this compound or compounds like it in BindingDB:
Activity Spreadsheet -- Enzyme Inhibition Constant Data from BindingDB
Found 1 hit for monomerid = 50265339
TargetNeuropeptide Y receptor type 5(Homo sapiens (Human))
Banyu Tsukuba Research Institute
Curated by ChEMBL
LigandPNGBDBM50265339(CHEMBL497786 | N-(2-(3-oxo-3H-spiro[isobenzofuran-...)
Affinity DataIC50:  130nM. Assay description: Binding affinity to human NPY Y5 receptor transfected in mouse LMtk cells
In DepthDetails ArticlePubMed