BDBM50265504 (R)-5-(phenylsulfonyl)-N-(1-(pyrrolidine-2-carbonyl)piperidin-4-yl)-2-(trifluoromethyl)benzenesulfonamide::5-(Phenylsulfonyl)-N-(1-D-prolylpiperidin-4-yl)-2-(trifluoromethyl)benzenesulfonamide::CHEMBL495536
SMILES FC(F)(F)c1ccc(cc1S(=O)(=O)NC1CCN(CC1)C(=O)[C@H]1CCCN1)S(=O)(=O)c1ccccc1
InChI Key InChIKey=CUKVPVAQKUDUCX-HXUWFJFHSA-N
Data  2 IC50  2 EC50
  Tab Delimited (TSV)   2D SDfile   Computed 3D by Vconf -m prep SDfile
Find this compound or compounds like it in BindingDB:
Activity Spreadsheet -- Enzyme Inhibition Constant Data from BindingDB
Found 4 hits for monomerid = 50265504
TargetProto-oncogene Wnt-3(Homo sapiens (Human))
Wyeth Research
Curated by ChEMBL
LigandPNGBDBM50265504((R)-5-(phenylsulfonyl)-N-(1-(pyrrolidine-2-carbony...)
Affinity DataEC50:  710nM. Assay description: Antagonist activity at human WNT3 expressed in human U2OS cells assessed as Wnt signaling after 16 to 18 hrs by luciferase reporter gene assay
In DepthDetails ArticlePubMed
TargetSecreted frizzled-related protein 1(Homo sapiens (Human))
Wyeth Research
Curated by ChEMBL
LigandPNGBDBM50265504((R)-5-(phenylsulfonyl)-N-(1-(pyrrolidine-2-carbony...)
Affinity DataIC50:  200nM. Assay description: Displacement of fluorescence probe compound from human SFRP1 after 30 mins by fluorescence polarization assay
In DepthDetails ArticlePubMed
TargetSecreted frizzled-related protein 1(Homo sapiens (Human))
Wyeth Research
Curated by ChEMBL
LigandPNGBDBM50265504((R)-5-(phenylsulfonyl)-N-(1-(pyrrolidine-2-carbony...)
Affinity DataEC50:  710nM. Assay description: Inhibition of human recombinant SFRP1 expressed in human U2OS cells assessed as increase in Wnt signaling after 16 to 18 hrs by luciferase reporter g...
In DepthDetails ArticlePubMed
TargetSecreted frizzled-related protein 1(Homo sapiens (Human))
Wyeth Research
Curated by ChEMBL
LigandPNGBDBM50265504((R)-5-(phenylsulfonyl)-N-(1-(pyrrolidine-2-carbony...)
Affinity DataIC50:  200nM. Assay description: Binding affinity to human purified SARP2 by fluorescent polarization assay
In DepthDetails ArticlePubMed