BDBM50265763 2-((((S)-3-amino-3-carboxypropyl)(hydroxy)phosphoryl)methyl)pentanedioic acid::CHEMBL496774
SMILES N[C@@H](CCP(O)(=O)CC(CCC(O)=O)C(O)=O)C(O)=O
InChI Key InChIKey=YLHAQDFYEKJARV-MLWJPKLSSA-N
Data  1 Kd
  Tab Delimited (TSV)   2D SDfile   Computed 3D by Vconf -m prep SDfile
Find this compound or compounds like it in BindingDB:
Activity Spreadsheet -- Enzyme Inhibition Constant Data from BindingDB
Found 1 hit for monomerid = 50265763
TargetGlutamate carboxypeptidase 2(Homo sapiens (Human))
Justus-Liebig-Universitat Giessen
Curated by ChEMBL
LigandPNGBDBM50265763(2-((((S)-3-amino-3-carboxypropyl)(hydroxy)phosphor...)
Affinity DataKd:  10.5nM. Assay description: Binding affinity to PSMA in human LNCaP cells assessed as cell surface binding in Tris-buffered saline buffer
In DepthDetails ArticlePubMed