BDBM50265861 (S)-N-(2-oxotetrahydrofuran-3-yl)-3-(3-(trifluoromethyl)phenyl)propanamide::CHEMBL513503
SMILES FC(F)(F)c1cccc(CCC(=O)N[C@H]2CCOC2=O)c1
InChI Key InChIKey=AWZNFZUIOLTADN-NSHDSACASA-N
Data  1 IC50
  Tab Delimited (TSV)   2D SDfile   Computed 3D by Vconf -m prep SDfile
Find this compound or compounds like it in BindingDB:
Activity Spreadsheet -- Enzyme Inhibition Constant Data from BindingDB
Found 1 hit for monomerid = 50265861
TargetTranscriptional activator protein LuxR(Vibrio fischeri (strain ATCC 700601 / ES114))
University Of Wisconsin-Madison
Curated by ChEMBL
LigandPNGBDBM50265861((S)-N-(2-oxotetrahydrofuran-3-yl)-3-(3-(trifluorom...)
Affinity DataIC50:  500nM. Assay description: Antagonist activity at Vibrio fischeri ES114 LuxR receptor assessed as inhibition of OHHL-induced response by luciferase reporter gene assay
In DepthDetails ArticlePubMed