BDBM50265919 3-(3-((4-tert-butylphenyl)ethynyl)phenyl)-1,2,4-oxadiazol-5(4H)-one::CHEMBL468607
SMILES CC(C)(C)c1ccc(cc1)C#Cc1cccc(c1)-c1nc(=O)o[nH]1
InChI Key InChIKey=AADHLRRKRYIBSN-UHFFFAOYSA-N
Data  3 EC50
  Tab Delimited (TSV)   2D SDfile   Computed 3D by Vconf -m prep SDfile
Find this compound or compounds like it in BindingDB:
Activity Spreadsheet -- Enzyme Inhibition Constant Data from BindingDB
Found 3 hits for monomerid = 50265919
TargetRetinoic acid receptor alpha(Homo sapiens (Human))
University Of Lille
Curated by ChEMBL
LigandPNGBDBM50265919(3-(3-((4-tert-butylphenyl)ethynyl)phenyl)-1,2,4-ox...)
Affinity DataEC50: >1.00E+3nM. Assay description: Activity at human RARalpha ligand binding domain expressed in COS7 cells cotransfected with Gal4-DBD assessed as transcriptional activation after 16 ...
In DepthDetails ArticlePubMed
TargetRetinoic acid receptor gamma(Homo sapiens (Human))
University Of Lille
Curated by ChEMBL
LigandPNGBDBM50265919(3-(3-((4-tert-butylphenyl)ethynyl)phenyl)-1,2,4-ox...)
Affinity DataEC50: >1.00E+3nM. Assay description: Activity at human RARgamma ligand binding domain expressed in COS7 cells cotransfected with Gal4-DBD assessed as transcriptional activation after 16 ...
In DepthDetails ArticlePubMed
TargetRetinoic acid receptor beta(Homo sapiens (Human))
University Of Lille
Curated by ChEMBL
LigandPNGBDBM50265919(3-(3-((4-tert-butylphenyl)ethynyl)phenyl)-1,2,4-ox...)
Affinity DataEC50: >1.00E+3nM. Assay description: Activity at human RARbeta ligand binding domain expressed in COS7 cells cotransfected with Gal4-DBD assessed as transcriptional activation after 16 h...
In DepthDetails ArticlePubMed