BDBM50265957 CHEMBL4105185
SMILES CN1CCN(CC1)c1ccc(Nc2nccc(n2)-c2cc3c(CCNC3=O)[nH]2)cc1
InChI Key InChIKey=HOUKCOGYXHMATN-UHFFFAOYSA-N
Data  5 IC50
PDB links: 1 PDB ID matches this monomer.
  Tab Delimited (TSV)   2D SDfile   Computed 3D by Vconf -m prep SDfile
Find this compound or compounds like it in BindingDB:
Activity Spreadsheet -- Enzyme Inhibition Constant Data from BindingDB
Found 5 hits for monomerid = 50265957
TargetMitogen-activated protein kinase 1(Homo sapiens (Human))
Astrazeneca
Curated by ChEMBL
LigandPNGBDBM50265957(CHEMBL4105185)
Affinity DataIC50:  370nM. Assay description: Inhibition of ERK2 (unknown origin) in the presence of 1 mM ATP
Ligand InfoPC cidPC sidPDB
TargetMitogen-activated protein kinase 1(Homo sapiens (Human))
Astrazeneca
Curated by ChEMBL
LigandPNGBDBM50265957(CHEMBL4105185)
Affinity DataIC50:  160nM. Assay description: Inhibition of ERK2 in human A375 cells harboring BRAF V600E mutant assessed as decrease in phosphorylated ERK2 levels
Ligand InfoPC cidPC sidPDB
TargetMitogen-activated protein kinase 1(Homo sapiens (Human))
Astrazeneca
Curated by ChEMBL
LigandPNGBDBM50265957(CHEMBL4105185)
Affinity DataIC50:  36nM. Assay description: Inhibition of ERK2 (unknown origin) in the presence of 60 uM ATP
Ligand InfoPC cidPC sidPDB
TargetMitogen-activated protein kinase 1(Homo sapiens (Human))
Astrazeneca
Curated by ChEMBL
LigandPNGBDBM50265957(CHEMBL4105185)
Affinity DataIC50:  570nM. Assay description: Inhibition of ERK2 in human A375 cells harboring BRAF V600E mutant assessed as decrease in phosphorylated RSK levels
Ligand InfoPC cidPC sidPDB
TargetDual specificity mitogen-activated protein kinase kinase 1(Homo sapiens (Human))
Astrazeneca
Curated by ChEMBL
LigandPNGBDBM50265957(CHEMBL4105185)
Affinity DataIC50:  1.90E+3nM. Assay description: Inhibition of MEK1 (unknown origin)
Ligand InfoPC cidPC sidPDB
In DepthDetails ArticlePubMed