BDBM50265982 (4-(furan-2-yl)-2-(isobutylamino)thiazol-5-yl)(phenyl)methanone::CHEMBL516948
SMILES CC(C)CNc1nc(-c2ccco2)c(s1)C(=O)c1ccccc1
InChI Key InChIKey=MYVPXLHJBRJPSV-UHFFFAOYSA-N
Data  2 KI
  Tab Delimited (TSV)   2D SDfile   Computed 3D by Vconf -m prep SDfile
Find this compound or compounds like it in BindingDB:
Activity Spreadsheet -- Enzyme Inhibition Constant Data from BindingDB
Found 2 hits for monomerid = 50265982
TargetAdenosine receptor A2a(Homo sapiens (Human))
Pharmacopeia
Curated by ChEMBL
LigandPNGBDBM50265982((4-(furan-2-yl)-2-(isobutylamino)thiazol-5-yl)(phe...)
Affinity DataKi:  89nM. Assay description: Displacement of [3H]SCH-58261 from human recombinant adenosine A2A receptor expressed in HEK293 cells
In DepthDetails ArticlePubMed
TargetAdenosine receptor A1(Homo sapiens (Human))
Pharmacopeia
Curated by ChEMBL
LigandPNGBDBM50265982((4-(furan-2-yl)-2-(isobutylamino)thiazol-5-yl)(phe...)
Affinity DataKi:  1.28E+3nM. Assay description: Displacement of [3H]DPCPX from human recombinant adenosine A1 receptor expressed in CHOK1 cells
In DepthDetails ArticlePubMed